Target
Kynurenine--oxoglutarate transaminase 1
Ligand
BDBM50364913
Substrate
Meas. Tech.
ChEMBL_804058 (CHEMBL1952453)
IC50
43000±n/a nM
Citation
 Akladios, FNNadvi, NAPark, JHanrahan, JRKapoor, VGorrell, MDChurch, WB Design and synthesis of novel inhibitors of human kynurenine aminotransferase-I. Bioorg Med Chem Lett 22:1579-81 (2012)  
Target
Name:
Kynurenine--oxoglutarate transaminase 1
Synonyms:
CCBL1 Glutamine--phenylpyruvate transaminase KYAT1 Kynurenine--oxoglutarate transaminase 1
Type:
Aminotransferase; Lyase
Mol. Mass.:
47874.00
Organism:
Homo sapiens (Human)
Description:
Recombinant hKAT-1 was expressed and purified from Sf9 insect cells.
Residue:
422
  
Inhibitor
Name:
BDBM50364913
Synonyms:
CHEMBL1950177
Type:
Small organic molecule
Emp. Form.:
C15H20N2O5
Mol. Mass.:
308.3297
SMILES:
CCOC(=O)C(CCCC(O)=O)=NNc1ccc(OC)cc1
: