Target
Nitric oxide synthase, inducible
Ligand
BDBM50365107
Substrate
Meas. Tech.
ChEMBL_805078 (CHEMBL1955556)
IC50
33960±n/a nM
Citation
 López-Cara, LCCarrión, MDEntrena, AGallo, MAEspinosa, ALópez, AEscames, GAcuña-Castroviejo, DCamacho, ME 1,3,4-Thiadiazole derivatives as selective inhibitors of iNOS versus nNOS: Synthesis and structure-activity dependence. Eur J Med Chem 50:129-39 (2012)  
Target
Name:
Nitric oxide synthase, inducible
Synonyms:
HEP-NOS Inducible NO synthase NOS type II NOS2A Nitric oxide synthase, inducible (iNOS) | iNOS
Type:
Homodimer
Mol. Mass.:
131141.95
Organism:
Homo sapiens (Human)
Description:
P35228
Residue:
1153
  
Inhibitor
Name:
BDBM50365107
Synonyms:
CHEMBL1951517
Type:
Small organic molecule
Emp. Form.:
C14H17N3OS
Mol. Mass.:
275.369
SMILES:
CC1(C)SC(=NN1C(=O)C1CC1)c1ccccc1N
: