Target
Mu-type opioid receptor
Ligand
BDBM50365109
Substrate
Meas. Tech.
ChEMBL_805242 (CHEMBL1955135)
Ki
74±n/a nM
Citation
 Iyer, MRLee, YSDeschamps, JRDersch, CMRothman, RBJacobson, AERice, KC Probes for narcotic receptor mediated phenomena. 44. Synthesis of an N-substituted 4-hydroxy-5-(3-hydroxyphenyl)morphan with high affinity and selectiveµ-antagonist activity. Eur J Med Chem 50:44-54 (2012)  
Target
Name:
Mu-type opioid receptor
Synonyms:
M-OR-1 MOR-1 MUOR1 Mu opiate receptor OPRM1 hMOP | mu-type opioid receptor isoform MOR-1
Type:
G Protein-Coupled Receptor (GPCR)
Mol. Mass.:
44789.51
Organism:
Homo sapiens (Human)
Description:
P35372
Residue:
400
  
Inhibitor
Name:
BDBM50365109
Synonyms:
CHEMBL1951701
Type:
Small organic molecule
Emp. Form.:
C22H27NO2
Mol. Mass.:
337.4553
SMILES:
O[C@H]1CN(CCc2ccccc2)[C@H]2CCC[C@@]1(C2)c1cccc(O)c1
: