Target
Peroxisome proliferator-activated receptor alpha
Ligand
BDBM50171898
Substrate
Meas. Tech.
ChEMBL_805973 (CHEMBL1960409)
EC50
500±n/a nM
Citation
 Fracchiolla, GLaghezza, APiemontese, LParente, MLavecchia, APochetti, GMontanari, RDi Giovanni, CCarbonara, GTortorella, PNovellino, ELoiodice, F Synthesis, biological evaluation and molecular investigation of fluorinated peroxisome proliferator-activated receptorsa/¿ dual agonists. Bioorg Med Chem 20:2141-51 (2012)  
Target
Name:
Peroxisome proliferator-activated receptor alpha
Synonyms:
NR1C1 PPAR PPAR-alpha PPARA_HUMAN Peroxisome proliferator-activated receptor | Peroxisome proliferator-activated receptor alpha (PPAR alpha)
Type:
Enzyme
Mol. Mass.:
52222.08
Organism:
Homo sapiens (Human)
Description:
Q07869
Residue:
468
  
Inhibitor
Name:
BDBM50171898
Synonyms:
(S)-3-Phenyl-2-(4-trifluoromethyl-phenoxy)-propionic acid | CHEMBL192518
Type:
Small organic molecule
Emp. Form.:
C16H13F3O3
Mol. Mass.:
310.2678
SMILES:
OC(=O)[C@H](Cc1ccccc1)Oc1ccc(cc1)C(F)(F)F
: