Target
Growth hormone secretagogue receptor type 1
Ligand
BDBM50365811
Substrate
Meas. Tech.
ChEMBL_806242 (CHEMBL1958783)
Ki
2±n/a nM
Citation
 Hanrahan, PBell, JBottomley, GBradley, SClarke, PCurtis, EDavis, SDawson, GHorswill, JKeily, JMoore, GRasamison, CBloxham, J Substituted azaquinazolinones as modulators of GHSr-1a for the treatment of type II diabetes and obesity. Bioorg Med Chem Lett 22:2271-8 (2012)  
Target
Name:
Growth hormone secretagogue receptor type 1
Synonyms:
GH-releasing peptide receptor GHS-R GHSR_HUMAN Ghrelin receptor | Ghrelin receptor 1a (GHS-R1a)
Type:
Receptor
Mol. Mass.:
41334.57
Organism:
Homo sapiens (Human)
Description:
Receptor binding studies use plasma membranes from LLC PK-1 cells transiently transfected with hGHSR1a.
Residue:
366
  
Inhibitor
Name:
BDBM50365811
Synonyms:
CHEMBL1956988
Type:
Small organic molecule
Emp. Form.:
C23H27FN4O2
Mol. Mass.:
410.4845
SMILES:
CC(C)N1CCC[C@H](Cn2c(C)nc3ccc(Oc4ccc(F)cc4)nc3c2=O)C1
: