Target
Growth hormone secretagogue receptor type 1
Ligand
BDBM50365816
Substrate
Meas. Tech.
ChEMBL_806242 (CHEMBL1958783)
Ki
3.1±n/a nM
Citation
 Hanrahan, PBell, JBottomley, GBradley, SClarke, PCurtis, EDavis, SDawson, GHorswill, JKeily, JMoore, GRasamison, CBloxham, J Substituted azaquinazolinones as modulators of GHSr-1a for the treatment of type II diabetes and obesity. Bioorg Med Chem Lett 22:2271-8 (2012)  
Target
Name:
Growth hormone secretagogue receptor type 1
Synonyms:
GH-releasing peptide receptor GHS-R GHSR_HUMAN Ghrelin receptor | Ghrelin receptor 1a (GHS-R1a)
Type:
Receptor
Mol. Mass.:
41334.57
Organism:
Homo sapiens (Human)
Description:
Receptor binding studies use plasma membranes from LLC PK-1 cells transiently transfected with hGHSR1a.
Residue:
366
  
Inhibitor
Name:
BDBM50365816
Synonyms:
CHEMBL1956995
Type:
Small organic molecule
Emp. Form.:
C27H31N5O3
Mol. Mass.:
473.5667
SMILES:
COc1ccc2cccc(Oc3ccc4nc(C)n(C[C@H]5CCCN(C5)C(C)C)c(=O)c4n3)c2n1
: