Target
Aromatase
Ligand
BDBM50366125
Substrate
Meas. Tech.
ChEMBL_808290 (CHEMBL1961307)
IC50
4±n/a nM
Citation
 Mayhoub, ASMarler, LKondratyuk, TPPark, EJPezzuto, JMCushman, M Optimization of the aromatase inhibitory activities of pyridylthiazole analogues of resveratrol. Bioorg Med Chem 20:2427-34 (2012)  
Target
Name:
Aromatase
Synonyms:
ARO1 CP19A_HUMAN CYP19 CYPXIX Cytochrome P450 19A1 Cytochrome P450-C19 (CYP19) FL cytokine receptor precursor | P-450AROM
Type:
Enzyme
Mol. Mass.:
57888.92
Organism:
Homo sapiens (Human)
Description:
P11511
Residue:
503
  
Inhibitor
Name:
BDBM50366125
Synonyms:
CHEMBL1957214
Type:
Small organic molecule
Emp. Form.:
C13H9N3S
Mol. Mass.:
239.296
SMILES:
c1sc(nc1-c1cccnc1)-c1ccncc1
: