Target
Purine nucleoside phosphorylase
Ligand
BDBM50214705
Substrate
Meas. Tech.
ChEMBL_162194 (CHEMBL766713)
Ki
18±n/a nM
Citation
 Halazy, SEggenspiller, AEhrhard, ADanzin, C Phosphonate derivatives of N9-benzylguanine: a new class of potent purine nucleoside phosphorylase inhibitors Bioorg Med Chem Lett 2:407-410 (1992)    Article 
Target
Name:
Purine nucleoside phosphorylase
Synonyms:
Inosine phosphorylase NP PNPH_HUMAN | Purine nucleoside phosphorylase (PNPase)
Type:
Enzyme
Mol. Mass.:
32119.53
Organism:
Homo sapiens (Human)
Description:
Residue:
289
  
Inhibitor
Name:
BDBM50214705
Synonyms:
5-(2-amino-6-oxo-1,6-dihydro-9H-purin-9-yl)-1,1-difluoropentylphosphonate 9-(5,5-DIFLUORO-5-PHOSPHONOPENTYL)GUANINE [5-(2-Amino-6-oxo-1,6-dihydro-purin-9-yl)-1,1-difluoro-pentyl]-phosphonic acid
Type:
Small organic molecule
Emp. Form.:
C10H14F2N5O4P
Mol. Mass.:
337.2198
SMILES:
Nc1nc2n(CCCCC(F)(F)P(O)(O)=O)cnc2c(=O)[nH]1
: