Target
Sigma non-opioid intracellular receptor 1
Ligand
BDBM50280515
Substrate
Meas. Tech.
ChEBML_226539
Ki
10000±n/a nM
Citation
 Rajagopalan, PScribner, RPennev, PSchmidt, WTam, SSteinfels, GCook, L DuP 747: a new, potent, kappa opioid analgesic. Synthesis and pharmacology1. Bioorg Med Chem Lett 2:715-720 (1992)    Article 
Target
Name:
Sigma non-opioid intracellular receptor 1
Synonyms:
Aging-associated gene 8 protein SGMR1_HUMAN SIGMAR1 SR31747-binding protein Sigma 1-type opioid receptor Sigma1R | hSigmaR1
Type:
Enzyme Catalytic Domain
Mol. Mass.:
25124.85
Organism:
Homo sapiens (Human)
Description:
Q99720
Residue:
223
  
Inhibitor
Name:
BDBM50280515
Synonyms:
2-(3,4-Dichloro-phenyl)-N-methyl-N-((1S,2S)-2-pyrrolidin-1-yl-1,2,3,4-tetrahydro-naphthalen-1-yl)-acetamide; hydrochloride | CHEMBL538806
Type:
Small organic molecule
Emp. Form.:
C23H26Cl2N2O
Mol. Mass.:
417.371
SMILES:
CN([C@@H]1[C@H](CCc2ccccc12)N1CCCC1)C(=O)Cc1ccc(Cl)c(Cl)c1
: