Target
Mu-type opioid receptor
Ligand
BDBM50280515
Substrate
Meas. Tech.
ChEBML_222066
Ki
545±n/a nM
Citation
 Rajagopalan, PScribner, RPennev, PSchmidt, WTam, SSteinfels, GCook, L DuP 747: a new, potent, kappa opioid analgesic. Synthesis and pharmacology1. Bioorg Med Chem Lett 2:715-720 (1992)    Article 
Target
Name:
Mu-type opioid receptor
Synonyms:
M-OR-1 MOR-1 MUOR1 Mu opiate receptor OPRM1 hMOP | mu-type opioid receptor isoform MOR-1
Type:
G Protein-Coupled Receptor (GPCR)
Mol. Mass.:
44789.51
Organism:
Homo sapiens (Human)
Description:
P35372
Residue:
400
  
Inhibitor
Name:
BDBM50280515
Synonyms:
2-(3,4-Dichloro-phenyl)-N-methyl-N-((1S,2S)-2-pyrrolidin-1-yl-1,2,3,4-tetrahydro-naphthalen-1-yl)-acetamide; hydrochloride | CHEMBL538806
Type:
Small organic molecule
Emp. Form.:
C23H26Cl2N2O
Mol. Mass.:
417.371
SMILES:
CN([C@@H]1[C@H](CCc2ccccc12)N1CCCC1)C(=O)Cc1ccc(Cl)c(Cl)c1
: