Target
Muscarinic acetylcholine receptor M1
Ligand
BDBM50280539
Substrate
Meas. Tech.
ChEMBL_139647 (CHEMBL872655)
Ki
2650±n/a nM
Citation
 Shapiro, GFloersheim, PAmstutz, RBoddeke, HBolliger, GCottens, SEnz, AGmelin, GGull, PSupavilai, P Muscarinic agonist SAR of azaspirodioxolanes Bioorg Med Chem Lett 2:815-820 (1992)    Article 
Target
Name:
Muscarinic acetylcholine receptor M1
Synonyms:
ACM1_RAT Chrm-1 cholinergic receptor, muscarinic 1
Type:
Enzyme Catalytic Domain
Mol. Mass.:
51390.46
Organism:
RAT
Description:
P08482
Residue:
460
  
Inhibitor
Name:
BDBM50280539
Synonyms:
2,8-Dimethyl-1-oxa-3-thia-8-aza-spiro[4.5]decane | CHEMBL424360
Type:
Small organic molecule
Emp. Form.:
C9H17NOS
Mol. Mass.:
187.302
SMILES:
CC1OC2(CS1)CCN(C)CC2
: