Target
Muscarinic acetylcholine receptor M1
Ligand
BDBM50280552
Substrate
Meas. Tech.
ChEMBL_139647 (CHEMBL872655)
Ki
2100±n/a nM
Citation
 Shapiro, GFloersheim, PAmstutz, RBoddeke, HBolliger, GCottens, SEnz, AGmelin, GGull, PSupavilai, P Muscarinic agonist SAR of azaspirodioxolanes Bioorg Med Chem Lett 2:815-820 (1992)    Article 
Target
Name:
Muscarinic acetylcholine receptor M1
Synonyms:
ACM1_RAT Chrm-1 cholinergic receptor, muscarinic 1
Type:
Enzyme Catalytic Domain
Mol. Mass.:
51390.46
Organism:
RAT
Description:
P08482
Residue:
460
  
Inhibitor
Name:
BDBM50280552
Synonyms:
2,8-Dimethyl-1,3-dithia-8-aza-spiro[4.5]decane | CHEMBL166695
Type:
Small organic molecule
Emp. Form.:
C9H17NS2
Mol. Mass.:
203.368
SMILES:
CC1SCC2(CCN(C)CC2)S1
: