Target
Muscarinic acetylcholine receptor M1
Ligand
BDBM50280549
Substrate
Meas. Tech.
ChEBML_139646
Ki
1750±n/a nM
Citation
 Shapiro, GFloersheim, PAmstutz, RBoddeke, HBolliger, GCottens, SEnz, AGmelin, GGull, PSupavilai, P Muscarinic agonist SAR of azaspirodioxolanes Bioorg Med Chem Lett 2:815-820 (1992)    Article 
Target
Name:
Muscarinic acetylcholine receptor M1
Synonyms:
ACM1_RAT Chrm-1 cholinergic receptor, muscarinic 1
Type:
Enzyme Catalytic Domain
Mol. Mass.:
51390.46
Organism:
RAT
Description:
P08482
Residue:
460
  
Inhibitor
Name:
BDBM50280549
Synonyms:
(Trans)-(R)-2,7-Dimethyl-1,3-dioxa-7-aza-spiro[4.4]nonane | CHEMBL167501
Type:
Small organic molecule
Emp. Form.:
C8H15NO2
Mol. Mass.:
157.2102
SMILES:
C[C@@H]1OCC2(CCN(C)C2)O1
: