Target
Muscarinic acetylcholine receptor M1
Ligand
BDBM50280535
Substrate
Meas. Tech.
ChEMBL_139647 (CHEMBL872655)
Ki
1250±n/a nM
Citation
 Shapiro, GFloersheim, PAmstutz, RBoddeke, HBolliger, GCottens, SEnz, AGmelin, GGull, PSupavilai, P Muscarinic agonist SAR of azaspirodioxolanes Bioorg Med Chem Lett 2:815-820 (1992)    Article 
Target
Name:
Muscarinic acetylcholine receptor M1
Synonyms:
ACM1_RAT Chrm-1 cholinergic receptor, muscarinic 1
Type:
Enzyme Catalytic Domain
Mol. Mass.:
51390.46
Organism:
RAT
Description:
P08482
Residue:
460
  
Inhibitor
Name:
BDBM50280535
Synonyms:
(2'R)-2'-methylspiro[4-azabicyclo[2.2.2]octane-2,5'-[1,3]oxathiolane] CHEMBL167593
Type:
Small organic molecule
Emp. Form.:
C10H17NOS
Mol. Mass.:
199.313
SMILES:
C[C@@H]1OC2(CS1)CN1CCC2CC1
: