Target
Muscarinic acetylcholine receptor M1
Ligand
BDBM50280553
Substrate
Meas. Tech.
ChEMBL_139646 (CHEMBL748259)
Ki
8.1±n/a nM
Citation
 Shapiro, GFloersheim, PAmstutz, RBoddeke, HBolliger, GCottens, SEnz, AGmelin, GGull, PSupavilai, P Muscarinic agonist SAR of azaspirodioxolanes Bioorg Med Chem Lett 2:815-820 (1992)    Article 
Target
Name:
Muscarinic acetylcholine receptor M1
Synonyms:
ACM1_RAT Chrm-1 cholinergic receptor, muscarinic 1
Type:
Enzyme Catalytic Domain
Mol. Mass.:
51390.46
Organism:
RAT
Description:
P08482
Residue:
460
  
Inhibitor
Name:
BDBM50280553
Synonyms:
8-Methyl-2,2-diphenyl-1,3-dioxa-8-aza-spiro[4.5]decane | CHEMBL352638
Type:
Small organic molecule
Emp. Form.:
C20H23NO2
Mol. Mass.:
309.4021
SMILES:
CN1CCC2(COC(O2)(c2ccccc2)c2ccccc2)CC1
: