Target
Muscarinic acetylcholine receptor M1
Ligand
BDBM50280537
Substrate
Meas. Tech.
ChEBML_139646
Ki
745±n/a nM
Citation
 Shapiro, GFloersheim, PAmstutz, RBoddeke, HBolliger, GCottens, SEnz, AGmelin, GGull, PSupavilai, P Muscarinic agonist SAR of azaspirodioxolanes Bioorg Med Chem Lett 2:815-820 (1992)    Article 
Target
Name:
Muscarinic acetylcholine receptor M1
Synonyms:
ACM1_RAT Chrm-1 cholinergic receptor, muscarinic 1
Type:
Enzyme Catalytic Domain
Mol. Mass.:
51390.46
Organism:
RAT
Description:
P08482
Residue:
460
  
Inhibitor
Name:
BDBM50280537
Synonyms:
2-Ethyl-8-methyl-1,3-dioxa-8-aza-spiro[4.5]decane | CHEMBL144679
Type:
Small organic molecule
Emp. Form.:
C10H19NO2
Mol. Mass.:
185.2634
SMILES:
CCC1OCC2(CCN(C)CC2)O1
: