Target
Muscarinic acetylcholine receptor M1
Ligand
BDBM50449646
Substrate
Meas. Tech.
ChEBML_139646
Ki
585±n/a nM
Citation
 Shapiro, GFloersheim, PAmstutz, RBoddeke, HBolliger, GCottens, SEnz, AGmelin, GGull, PSupavilai, P Muscarinic agonist SAR of azaspirodioxolanes Bioorg Med Chem Lett 2:815-820 (1992)    Article 
Target
Name:
Muscarinic acetylcholine receptor M1
Synonyms:
ACM1_RAT Chrm-1 cholinergic receptor, muscarinic 1
Type:
Enzyme Catalytic Domain
Mol. Mass.:
51390.46
Organism:
RAT
Description:
P08482
Residue:
460
  
Inhibitor
Name:
BDBM50449646
Synonyms:
CHEMBL2021360
Type:
Small organic molecule
Emp. Form.:
C8H15NOS
Mol. Mass.:
173.276
SMILES:
C[C@H]1OC2(CCN(C)C2)CS1
: