Target
Muscarinic acetylcholine receptor M1
Ligand
BDBM50280555
Substrate
Meas. Tech.
ChEMBL_139647 (CHEMBL872655)
Ki
5000±n/a nM
Citation
 Shapiro, GFloersheim, PAmstutz, RBoddeke, HBolliger, GCottens, SEnz, AGmelin, GGull, PSupavilai, P Muscarinic agonist SAR of azaspirodioxolanes Bioorg Med Chem Lett 2:815-820 (1992)    Article 
Target
Name:
Muscarinic acetylcholine receptor M1
Synonyms:
ACM1_RAT Chrm-1 cholinergic receptor, muscarinic 1
Type:
Enzyme Catalytic Domain
Mol. Mass.:
51390.46
Organism:
RAT
Description:
P08482
Residue:
460
  
Inhibitor
Name:
BDBM50280555
Synonyms:
2,8,8-Trimethyl-1,3-dioxa-8-azonia-spiro[4.5]decane | CHEMBL168609
Type:
Small organic molecule
Emp. Form.:
C10H20NO2
Mol. Mass.:
186.2708
SMILES:
CC1OCC2(CC[N+](C)(C)CC2)O1
: