Target
Muscarinic acetylcholine receptor M1
Ligand
BDBM50280558
Substrate
Meas. Tech.
ChEMBL_139646 (CHEMBL748259)
Ki
87±n/a nM
Citation
 Shapiro, GFloersheim, PAmstutz, RBoddeke, HBolliger, GCottens, SEnz, AGmelin, GGull, PSupavilai, P Muscarinic agonist SAR of azaspirodioxolanes Bioorg Med Chem Lett 2:815-820 (1992)    Article 
Target
Name:
Muscarinic acetylcholine receptor M1
Synonyms:
ACM1_RAT Chrm-1 cholinergic receptor, muscarinic 1
Type:
Enzyme Catalytic Domain
Mol. Mass.:
51390.46
Organism:
RAT
Description:
P08482
Residue:
460
  
Inhibitor
Name:
BDBM50280558
Synonyms:
2-Ethyl-8-methyl-8-aza-spiro[4.5]decane-1,3-dione | CHEMBL433912
Type:
Small organic molecule
Emp. Form.:
C12H19NO2
Mol. Mass.:
209.2848
SMILES:
CCC1C(=O)CC2(CCN(C)CC2)C1=O
: