Target
Muscarinic acetylcholine receptor M1
Ligand
BDBM50280540
Substrate
Meas. Tech.
ChEMBL_139646 (CHEMBL748259)
Ki
30±n/a nM
Citation
 Shapiro, GFloersheim, PAmstutz, RBoddeke, HBolliger, GCottens, SEnz, AGmelin, GGull, PSupavilai, P Muscarinic agonist SAR of azaspirodioxolanes Bioorg Med Chem Lett 2:815-820 (1992)    Article 
Target
Name:
Muscarinic acetylcholine receptor M1
Synonyms:
ACM1_RAT Chrm-1 cholinergic receptor, muscarinic 1
Type:
Enzyme Catalytic Domain
Mol. Mass.:
51390.46
Organism:
RAT
Description:
P08482
Residue:
460
  
Inhibitor
Name:
BDBM50280540
Synonyms:
Azaspirodioxolane analogue | CHEMBL170388
Type:
Small organic molecule
Emp. Form.:
C9H15NO2
Mol. Mass.:
169.2209
SMILES:
CC1OC[C@@]2(CN3CCC2C3)O1
: