Target
Muscarinic acetylcholine receptor M1
Ligand
BDBM50280554
Substrate
Meas. Tech.
ChEMBL_139646 (CHEMBL748259)
Ki
295±n/a nM
Citation
 Shapiro, GFloersheim, PAmstutz, RBoddeke, HBolliger, GCottens, SEnz, AGmelin, GGull, PSupavilai, P Muscarinic agonist SAR of azaspirodioxolanes Bioorg Med Chem Lett 2:815-820 (1992)    Article 
Target
Name:
Muscarinic acetylcholine receptor M1
Synonyms:
ACM1_RAT Chrm-1 cholinergic receptor, muscarinic 1
Type:
Enzyme Catalytic Domain
Mol. Mass.:
51390.46
Organism:
RAT
Description:
P08482
Residue:
460
  
Inhibitor
Name:
BDBM50280554
Synonyms:
2-Ethynyl-8-methyl-1,3-dioxa-8-aza-spiro[4.5]decane | CHEMBL168595
Type:
Small organic molecule
Emp. Form.:
C10H15NO2
Mol. Mass.:
181.2316
SMILES:
CN1CCC2(COC(O2)C#C)CC1
: