Target
Muscarinic acetylcholine receptor M1
Ligand
BDBM50006243
Substrate
Meas. Tech.
ChEMBL_139647 (CHEMBL872655)
Ki
5680±n/a nM
Citation
 Shapiro, GFloersheim, PAmstutz, RBoddeke, HBolliger, GCottens, SEnz, AGmelin, GGull, PSupavilai, P Muscarinic agonist SAR of azaspirodioxolanes Bioorg Med Chem Lett 2:815-820 (1992)    Article 
Target
Name:
Muscarinic acetylcholine receptor M1
Synonyms:
ACM1_RAT Chrm-1 cholinergic receptor, muscarinic 1
Type:
Enzyme Catalytic Domain
Mol. Mass.:
51390.46
Organism:
RAT
Description:
P08482
Residue:
460
  
Inhibitor
Name:
BDBM50006243
Synonyms:
((2S,4R,5S)-4-Hydroxy-5-methyl-tetrahydro-furan-2-ylmethyl)-trimethyl-ammonium CHEMBL12587 | CHEMBL292911
Type:
Small organic molecule
Emp. Form.:
C9H20NO2
Mol. Mass.:
174.2601
SMILES:
C[C@@H]1O[C@H](C[N+](C)(C)C)C[C@H]1O
: