Target
Muscarinic acetylcholine receptor M1
Ligand
BDBM50067479
Substrate
Meas. Tech.
ChEBML_139646
Ki
1850±n/a nM
Citation
 Shapiro, GFloersheim, PAmstutz, RBoddeke, HBolliger, GCottens, SEnz, AGmelin, GGull, PSupavilai, P Muscarinic agonist SAR of azaspirodioxolanes Bioorg Med Chem Lett 2:815-820 (1992)    Article 
Target
Name:
Muscarinic acetylcholine receptor M1
Synonyms:
ACM1_RAT Chrm-1 cholinergic receptor, muscarinic 1
Type:
Enzyme Catalytic Domain
Mol. Mass.:
51390.46
Organism:
RAT
Description:
P08482
Residue:
460
  
Inhibitor
Name:
BDBM50067479
Synonyms:
2'-methyl-(2'S)-spiro[4-azabicyclo[2.2.1]heptane-2,4'-(dihydro[1,3]dioxolane)] CHEMBL134830
Type:
Small organic molecule
Emp. Form.:
C9H15NO2
Mol. Mass.:
169.2209
SMILES:
C[C@H]1OCC2(CN3CCC2C3)O1
: