Target
Muscarinic acetylcholine receptor M1
Ligand
BDBM50280548
Substrate
Meas. Tech.
ChEBML_139646
Ki
870±n/a nM
Citation
 Shapiro, GFloersheim, PAmstutz, RBoddeke, HBolliger, GCottens, SEnz, AGmelin, GGull, PSupavilai, P Muscarinic agonist SAR of azaspirodioxolanes Bioorg Med Chem Lett 2:815-820 (1992)    Article 
Target
Name:
Muscarinic acetylcholine receptor M1
Synonyms:
ACM1_RAT Chrm-1 cholinergic receptor, muscarinic 1
Type:
Enzyme Catalytic Domain
Mol. Mass.:
51390.46
Organism:
RAT
Description:
P08482
Residue:
460
  
Inhibitor
Name:
BDBM50280548
Synonyms:
2-Methoxy-8-methyl-1,3-dioxa-8-aza-spiro[4.5]decane | CHEMBL168685
Type:
Small organic molecule
Emp. Form.:
C9H17NO3
Mol. Mass.:
187.2362
SMILES:
COC1OCC2(CCN(C)CC2)O1
: