Target
Squalene synthase
Ligand
BDBM50051873
Substrate
Meas. Tech.
ChEBML_201960
IC50
5±n/a nM
Citation
 Watson, NSBell, RChan, CCox, BHutson, JLKeeling, SEKirk, BEProcopiou, PASteeples, IPWiddowson, J The squalestatins: potent inhibitors of squalene synthase. The role of the tricarboxylic acid moiety. Bioorg Med Chem Lett 3:2541-2546 (1993)    Article 
Target
Name:
Squalene synthase
Synonyms:
FDFT1 FPP:FPP farnesyltransferase SQS Squalene synthetase
Type:
PROTEIN
Mol. Mass.:
48114.76
Organism:
Homo sapiens (Human)
Description:
ChEMBL_1352847
Residue:
417
  
Inhibitor
Name:
BDBM50051873
Synonyms:
(1S,3S,4S,5R,6R,7R)-1-((4S,5R)-4-Acetoxy-5-methyl-3-methylene-6-phenyl-hexyl)-4,7-dihydroxy-6-((S)-6-methyl-4-methyl-oct-2-enoyloxy)-2,8-dioxa-bicyclo[3.2.1]octane-3,4,5-tricarboxylic acid 7-[3,5-dimethyl-(E)-1-heptenylcarbonyloxy]-2,6-dihydroxy-5-[3-(2-methyl-1-methylcarbonyloxy-3-phenylpropyl)-3-butenyl]-4,8-dioxabicyclo[3.2.1]octane-1,2,3-tricarboxylic acid Zaragozic Acids A
Type:
Small organic molecule
Emp. Form.:
C35H46O14
Mol. Mass.:
690.7313
SMILES:
CC[C@H](C)C[C@H](C)\C=C\C(=O)O[C@@H]1[C@@H](O)[C@]2(CCC(=C)[C@@H](OC(C)=O)[C@H](C)Cc3ccccc3)O[C@@]1(C(O)=O)[C@@](O)([C@H](O2)C(O)=O)C(O)=O
: