Target
S-adenosylmethionine decarboxylase proenzyme
Ligand
BDBM50281292
Substrate
Meas. Tech.
ChEMBL_196574 (CHEMBL800452)
Ki
246600±n/a nM
Citation
 Wu, YQLawrence, TGuo, JQWoster, PM -cyano-substituted analogoues of decarboxylated S-adenosylmethionine as enzyme activated, irreversible inhibitors of S-adenosylmethionine decarboxylase Bioorg Med Chem Lett 3:2811-2816 (1993)    Article 
Target
Name:
S-adenosylmethionine decarboxylase proenzyme
Synonyms:
AMD DCAM_HUMAN S-adenosylmethionine decarboxylase 1 | SAMDC
Type:
Heterotetramer of two alpha and two beta chains
Mol. Mass.:
38337.21
Organism:
Homo sapiens (Human)
Description:
For the production of protein for the hAdoMetDC enzyme assays, the plasmid containing (H)6 tag at the carboxyl end (replacing -QQQQQS) was used.
Residue:
334
  
Inhibitor
Name:
BDBM50281292
Synonyms:
2-amino-4-({[(2S,3S,4R)-5-(6-amino-9H-purin-9-yl)-3,4-dihydroxyoxolan-2-yl]methyl}(methyl)-sulfanyl)butanenitrile dihydrobromide CHEMBL541928
Type:
Small organic molecule
Emp. Form.:
C15H23Br2N7O3S
Mol. Mass.:
541.261
SMILES:
Br.[Br-].C[S+](CCC(N)C#N)C[C@H]1O[C@H]([C@H](O)[C@@H]1O)n1cnc2c(N)ncnc12
: