Target
S-adenosylmethionine decarboxylase proenzyme
Ligand
BDBM50366319
Substrate
Meas. Tech.
ChEBML_197377
Ki
1070000±n/a nM
Citation
 Guo, JQWu, YQFarmer, WLDouglas, KAWoster, PMGarofalo, JBasshi, CJ Restricted rotation analogs of S-adenosylmethionine: synthesis, evaluation as inhibitors of S-adenosylmethionine decarboxylase, and potential use as selective antitrypanosomal agents Bioorg Med Chem Lett 3:147-152 (1993)    Article 
Target
Name:
S-adenosylmethionine decarboxylase proenzyme
Synonyms:
AMD DCAM_HUMAN S-adenosylmethionine decarboxylase 1 | SAMDC
Type:
Heterotetramer of two alpha and two beta chains
Mol. Mass.:
38337.21
Organism:
Homo sapiens (Human)
Description:
For the production of protein for the hAdoMetDC enzyme assays, the plasmid containing (H)6 tag at the carboxyl end (replacing -QQQQQS) was used.
Residue:
334
  
Inhibitor
Name:
BDBM50366319
Synonyms:
CHEMBL1791405 | CHEMBL3392205
Type:
Small organic molecule
Emp. Form.:
C16H26N6O13S3
Mol. Mass.:
606.605
SMILES:
OS(O)(=O)=O.OS([O-])(=O)=O.C[S+](C[C@H]1O[C@H]([C@H](O)[C@@H]1O)n1cnc2c(N)ncnc12)C1CN[C@@H](C1)C(O)=O
: