Target
S-adenosylmethionine decarboxylase proenzyme
Ligand
BDBM50366317
Substrate
Meas. Tech.
ChEBML_197377
Ki
669000±n/a nM
Citation
 Guo, JQWu, YQFarmer, WLDouglas, KAWoster, PMGarofalo, JBasshi, CJ Restricted rotation analogs of S-adenosylmethionine: synthesis, evaluation as inhibitors of S-adenosylmethionine decarboxylase, and potential use as selective antitrypanosomal agents Bioorg Med Chem Lett 3:147-152 (1993)    Article 
Target
Name:
S-adenosylmethionine decarboxylase proenzyme
Synonyms:
AMD DCAM_HUMAN S-adenosylmethionine decarboxylase 1 | SAMDC
Type:
Heterotetramer of two alpha and two beta chains
Mol. Mass.:
38337.21
Organism:
Homo sapiens (Human)
Description:
For the production of protein for the hAdoMetDC enzyme assays, the plasmid containing (H)6 tag at the carboxyl end (replacing -QQQQQS) was used.
Residue:
334
  
Inhibitor
Name:
BDBM50366317
Synonyms:
CHEMBL3392204 | CHEMBL606102
Type:
Small organic molecule
Emp. Form.:
C15H26N6O11S3
Mol. Mass.:
562.596
SMILES:
OS(O)(=O)=O.OS([O-])(=O)=O.C[S+](C[C@H]1O[C@H]([C@H](O)[C@@H]1O)n1cnc2c(N)ncnc12)C1CCNC1
: