Target
Tissue alpha-L-fucosidase
Ligand
BDBM50285246
Substrate
Meas. Tech.
ChEMBL_216279 (CHEMBL819885)
Ki
7000±n/a nM
Citation
 Witczak, ZJSun, JMielguj, R Synthesis of L-fucopyranosyl-4-thiodisaccharides from levoglucosenone and their inhibitory activity on -L-fucosidase Bioorg Med Chem Lett 5:2169-2174 (1995)    Article 
Target
Name:
Tissue alpha-L-fucosidase
Synonyms:
Alpha-L-fucosidase I FUCA1 Tissue alpha-L-fucosidase
Type:
PROTEIN
Mol. Mass.:
53690.69
Organism:
Homo sapiens (Human)
Description:
ChEMBL_34088
Residue:
466
  
Inhibitor
Name:
BDBM50285246
Synonyms:
2,6-Diimino-hexane-1,3,4,5-tetraol | CHEMBL71731
Type:
Small organic molecule
Emp. Form.:
C6H12N2O4
Mol. Mass.:
176.1705
SMILES:
NCC(O)C(=O)C(=O)C(N)CO
: