Target
Tissue alpha-L-fucosidase
Ligand
BDBM50285243
Substrate
Meas. Tech.
ChEMBL_216279 (CHEMBL819885)
Ki
42000±n/a nM
Citation
 Witczak, ZJSun, JMielguj, R Synthesis of L-fucopyranosyl-4-thiodisaccharides from levoglucosenone and their inhibitory activity on -L-fucosidase Bioorg Med Chem Lett 5:2169-2174 (1995)    Article 
Target
Name:
Tissue alpha-L-fucosidase
Synonyms:
Alpha-L-fucosidase I FUCA1 Tissue alpha-L-fucosidase
Type:
PROTEIN
Mol. Mass.:
53690.69
Organism:
Homo sapiens (Human)
Description:
ChEMBL_34088
Residue:
466
  
Inhibitor
Name:
BDBM50285243
Synonyms:
(2R,3S,4S,5S,6S)-5-Mercapto-6-methyl-tetrahydro-pyran-2,3,4-triol | CHEMBL420006
Type:
Small organic molecule
Emp. Form.:
C6H12O4S
Mol. Mass.:
180.222
SMILES:
C[C@@H]1O[C@@H](O)[C@@H](O)[C@H](O)[C@@H]1S
: