Target
Endothelin-1 receptor
Ligand
BDBM50366415
Substrate
Meas. Tech.
ChEBML_63195
IC50
13000±n/a nM
Citation
 Leonard, DMReily, MDDunbar, JBHolub, KECody, WLHill, KEWelch, KMFlynn, MAReynolds, EEDoherty, AM Structure-activity and biophysical studies of the C-terminal hexapeptide of endothelin Bioorg Med Chem Lett 5:967-972 (1995)    Article 
Target
Name:
Endothelin-1 receptor
Synonyms:
EDNRA ET-A ETA-R Endothelin receptor type A hET-AR
Type:
Enzyme Catalytic Domain
Mol. Mass.:
48736.88
Organism:
Homo sapiens (Human)
Description:
P25101
Residue:
427
  
Inhibitor
Name:
BDBM50366415
Synonyms:
CHEMBL1791280
Type:
Small organic molecule
Emp. Form.:
C41H60N10O9
Mol. Mass.:
836.9767
SMILES:
CC[C@H](C)[C@H](NC(=O)[C@H](CC(N)=O)NC(=O)[C@H](CC(C)C)NC(=O)[C@H](Cc1cnc[nH]1)NC(C)=O)C(=O)N[C@@H]([C@@H](C)CC)C(=O)N[C@@H](Cc1c[nH]c2ccccc12)C(O)=O
: