Target
Endothelin receptor type B
Ligand
BDBM50366415
Substrate
Meas. Tech.
ChEBML_64047
IC50
8300±n/a nM
Citation
 Leonard, DMReily, MDDunbar, JBHolub, KECody, WLHill, KEWelch, KMFlynn, MAReynolds, EEDoherty, AM Structure-activity and biophysical studies of the C-terminal hexapeptide of endothelin Bioorg Med Chem Lett 5:967-972 (1995)    Article 
Target
Name:
Endothelin receptor type B
Synonyms:
EDNRB_RAT ET-B Endothelin receptor | Endothelin receptor non-selective type
Type:
Enzyme Catalytic Domain
Mol. Mass.:
49483.43
Organism:
RAT
Description:
ENDOTHELIN B EDNRB RAT::P21451
Residue:
442
  
Inhibitor
Name:
BDBM50366415
Synonyms:
CHEMBL1791280
Type:
Small organic molecule
Emp. Form.:
C41H60N10O9
Mol. Mass.:
836.9767
SMILES:
CC[C@H](C)[C@H](NC(=O)[C@H](CC(N)=O)NC(=O)[C@H](CC(C)C)NC(=O)[C@H](Cc1cnc[nH]1)NC(C)=O)C(=O)N[C@@H]([C@@H](C)CC)C(=O)N[C@@H](Cc1c[nH]c2ccccc12)C(O)=O
: