Target
Serine protease 1
Ligand
BDBM50289374
Substrate
Meas. Tech.
ChEBML_212327
pH
7.5±n/a
Ki
>500000±n/a nM
Comments
extracted
Citation
 von der Saal, WKucznierz, RLeinert, HEngh, RA DERIVATIVES OF 4-AMINO-PYRIDINE AS SELECTIVE THROMBIN INHIBITORS Bioorg Med Chem Lett 7:1283-1288 (1997)    Article 
Target
Name:
Serine protease 1
Synonyms:
Beta-Trypsin PRSS1 TRY1 TRYP1 Trypsin I
Type:
Enzyme
Mol. Mass.:
25790.52
Organism:
Bos taurus (bovine)
Description:
P00760
Residue:
246
  
Inhibitor
Name:
BDBM50289374
Synonyms:
(2-Phenoxy-ethyl)-pyridin-4-yl-amine | CHEMBL285311
Type:
Small organic molecule
Emp. Form.:
C13H14N2O
Mol. Mass.:
214.2631
SMILES:
C(COc1ccccc1)Nc1ccncc1
: