Target
Serine protease 1
Ligand
BDBM50289375
Substrate
Meas. Tech.
ChEBML_212327
pH
7.5±n/a
Ki
>500000±n/a nM
Comments
extracted
Citation
 von der Saal, WKucznierz, RLeinert, HEngh, RA DERIVATIVES OF 4-AMINO-PYRIDINE AS SELECTIVE THROMBIN INHIBITORS Bioorg Med Chem Lett 7:1283-1288 (1997)    Article 
Target
Name:
Serine protease 1
Synonyms:
Beta-Trypsin PRSS1 TRY1 TRYP1 Trypsin I
Type:
Enzyme
Mol. Mass.:
25790.52
Organism:
Bos taurus (bovine)
Description:
P00760
Residue:
246
  
Inhibitor
Name:
BDBM50289375
Synonyms:
2-Benzenesulfonylamino-N-[(R)-1-(piperidine-1-carbonyl)-3-(pyridin-4-ylamino)-propyl]-acetamide | CHEMBL281715
Type:
Small organic molecule
Emp. Form.:
C22H29N5O4S
Mol. Mass.:
459.562
SMILES:
O=C(CNS(=O)(=O)c1ccccc1)N[C@H](CCNc1ccncc1)C(=O)N1CCCCC1
: