Target
Serine protease 1
Ligand
BDBM50126700
Substrate
Meas. Tech.
ChEBML_212327
pH
7.5±n/a
Ki
>500000±n/a nM
Comments
extracted
Citation
 von der Saal, WKucznierz, RLeinert, HEngh, RA DERIVATIVES OF 4-AMINO-PYRIDINE AS SELECTIVE THROMBIN INHIBITORS Bioorg Med Chem Lett 7:1283-1288 (1997)    Article 
Target
Name:
Serine protease 1
Synonyms:
Beta-Trypsin PRSS1 TRY1 TRYP1 Trypsin I
Type:
Enzyme
Mol. Mass.:
25790.52
Organism:
Bos taurus (bovine)
Description:
P00760
Residue:
246
  
Inhibitor
Name:
BDBM50126700
Synonyms:
4-Chloro-N-{3-[2-(pyridin-4-ylamino)-ethoxy]-phenyl}-benzenesulfonamide | CHEMBL23252
Type:
Small organic molecule
Emp. Form.:
C19H18ClN3O3S
Mol. Mass.:
403.883
SMILES:
Clc1ccc(cc1)S(=O)(=O)Nc1cccc(OCCNc2ccncc2)c1
: