Target
Plasminogen
Ligand
BDBM50070632
Substrate
Meas. Tech.
ChEBML_155257
pH
7.5±n/a
Ki
>500000±n/a nM
Comments
extracted
Citation
 von der Saal, WKucznierz, RLeinert, HEngh, RA DERIVATIVES OF 4-AMINO-PYRIDINE AS SELECTIVE THROMBIN INHIBITORS Bioorg Med Chem Lett 7:1283-1288 (1997)    Article 
Target
Name:
Plasminogen
Synonyms:
Activation peptide PLG Plasmin Plasmin heavy chain A, short form | Plasmin light chain B
Type:
Enzyme
Mol. Mass.:
90579.18
Organism:
Homo sapiens (Human)
Description:
Residue:
810
  
Inhibitor
Name:
BDBM50070632
Synonyms:
4-[2-(3-Benzenesulfonylamino-phenoxy)-ethylamino]-pyridinium N-{3-[2-(Pyridin-4-ylamino)-ethoxy]-phenyl}-benzenesulfonamide
Type:
Small organic molecule
Emp. Form.:
C19H19N3O3S
Mol. Mass.:
369.437
SMILES:
O=S(=O)(Nc1cccc(OCCNc2ccncc2)c1)c1ccccc1
: