Target
Plasminogen
Ligand
BDBM50289374
Substrate
Meas. Tech.
ChEBML_155257
pH
7.5±n/a
Ki
>500000±n/a nM
Comments
extracted
Citation
 von der Saal, WKucznierz, RLeinert, HEngh, RA DERIVATIVES OF 4-AMINO-PYRIDINE AS SELECTIVE THROMBIN INHIBITORS Bioorg Med Chem Lett 7:1283-1288 (1997)    Article 
Target
Name:
Plasminogen
Synonyms:
Activation peptide PLG Plasmin Plasmin heavy chain A, short form | Plasmin light chain B
Type:
Enzyme
Mol. Mass.:
90579.18
Organism:
Homo sapiens (Human)
Description:
Residue:
810
  
Inhibitor
Name:
BDBM50289374
Synonyms:
(2-Phenoxy-ethyl)-pyridin-4-yl-amine | CHEMBL285311
Type:
Small organic molecule
Emp. Form.:
C13H14N2O
Mol. Mass.:
214.2631
SMILES:
C(COc1ccccc1)Nc1ccncc1
: