Target
Plasminogen
Ligand
BDBM50289373
Substrate
Meas. Tech.
ChEBML_155257
pH
7.5±n/a
Ki
>500000±n/a nM
Comments
extracted
Citation
 von der Saal, WKucznierz, RLeinert, HEngh, RA DERIVATIVES OF 4-AMINO-PYRIDINE AS SELECTIVE THROMBIN INHIBITORS Bioorg Med Chem Lett 7:1283-1288 (1997)    Article 
Target
Name:
Plasminogen
Synonyms:
Activation peptide PLG Plasmin Plasmin heavy chain A, short form | Plasmin light chain B
Type:
Enzyme
Mol. Mass.:
90579.18
Organism:
Homo sapiens (Human)
Description:
Residue:
810
  
Inhibitor
Name:
BDBM50289373
Synonyms:
2-(4-Chloro-benzenesulfonylamino)-N-[(R)-1-(piperidine-1-carbonyl)-3-(pyridin-4-ylamino)-propyl]-acetamide | CHEMBL23468
Type:
Small organic molecule
Emp. Form.:
C22H28ClN5O4S
Mol. Mass.:
494.007
SMILES:
Clc1ccc(cc1)S(=O)(=O)NCC(=O)N[C@H](CCNc1ccncc1)C(=O)N1CCCCC1
: