Target
Prothrombin
Ligand
BDBM50289377
Substrate
Meas. Tech.
ChEBML_208536
pH
7.5±n/a
Ki
1500±n/a nM
Comments
extracted
Citation
 von der Saal, WKucznierz, RLeinert, HEngh, RA DERIVATIVES OF 4-AMINO-PYRIDINE AS SELECTIVE THROMBIN INHIBITORS Bioorg Med Chem Lett 7:1283-1288 (1997)    Article 
Target
Name:
Prothrombin
Synonyms:
Activation peptide fragment 1 Coagulation factor II Prothrombin precursor Thrombin heavy chain | Thrombin light chain
Type:
Protein
Mol. Mass.:
70029.57
Organism:
Homo sapiens (Human)
Description:
P00734
Residue:
622
  
Inhibitor
Name:
BDBM50289377
Synonyms:
4-{3-[2-(4-Chloro-benzenesulfonylamino)-ethyl]-phenoxymethyl}-benzamidine | CHEMBL24827
Type:
Small organic molecule
Emp. Form.:
C22H22ClN3O3S
Mol. Mass.:
443.946
SMILES:
NC(=N)c1ccc(COc2cccc(CCNS(=O)(=O)c3ccc(Cl)cc3)c2)cc1
: