Target
Prothrombin
Ligand
BDBM50289381
Substrate
Meas. Tech.
ChEBML_208536
pH
7.5±n/a
Ki
7000±n/a nM
Comments
extracted
Citation
 von der Saal, WKucznierz, RLeinert, HEngh, RA DERIVATIVES OF 4-AMINO-PYRIDINE AS SELECTIVE THROMBIN INHIBITORS Bioorg Med Chem Lett 7:1283-1288 (1997)    Article 
Target
Name:
Prothrombin
Synonyms:
Activation peptide fragment 1 Coagulation factor II Prothrombin precursor Thrombin heavy chain | Thrombin light chain
Type:
Protein
Mol. Mass.:
70029.57
Organism:
Homo sapiens (Human)
Description:
P00734
Residue:
622
  
Inhibitor
Name:
BDBM50289381
Synonyms:
CHEMBL23246 | Naphthalene-2-sulfonic acid {3-[2-(pyridin-4-ylamino)-ethoxy]-phenyl}-amide
Type:
Small organic molecule
Emp. Form.:
C23H21N3O3S
Mol. Mass.:
419.496
SMILES:
O=S(=O)(Nc1cccc(OCCNc2ccncc2)c1)c1ccc2ccccc2c1
: