Target
Prothrombin
Ligand
BDBM50070596
Substrate
Meas. Tech.
ChEBML_208536
pH
7.5±n/a
Ki
70±n/a nM
Comments
extracted
Citation
 von der Saal, WKucznierz, RLeinert, HEngh, RA DERIVATIVES OF 4-AMINO-PYRIDINE AS SELECTIVE THROMBIN INHIBITORS Bioorg Med Chem Lett 7:1283-1288 (1997)    Article 
Target
Name:
Prothrombin
Synonyms:
Activation peptide fragment 1 Coagulation factor II Prothrombin precursor Thrombin heavy chain | Thrombin light chain
Type:
Protein
Mol. Mass.:
70029.57
Organism:
Homo sapiens (Human)
Description:
P00734
Residue:
622
  
Inhibitor
Name:
BDBM50070596
Synonyms:
CHEMBL282549 | N-Methyl-N-{3-[2-(pyridin-4-ylamino)-ethoxy]-phenyl}-benzenesulfonamide
Type:
Small organic molecule
Emp. Form.:
C20H21N3O3S
Mol. Mass.:
383.464
SMILES:
CN(c1cccc(OCCNc2ccncc2)c1)S(=O)(=O)c1ccccc1
: