Target
Plasminogen
Ligand
BDBM50289381
Substrate
Meas. Tech.
ChEBML_155257
pH
7.5±n/a
Ki
>500000±n/a nM
Comments
extracted
Citation
 von der Saal, WKucznierz, RLeinert, HEngh, RA DERIVATIVES OF 4-AMINO-PYRIDINE AS SELECTIVE THROMBIN INHIBITORS Bioorg Med Chem Lett 7:1283-1288 (1997)    Article 
Target
Name:
Plasminogen
Synonyms:
Activation peptide PLG Plasmin Plasmin heavy chain A, short form | Plasmin light chain B
Type:
Enzyme
Mol. Mass.:
90579.18
Organism:
Homo sapiens (Human)
Description:
Residue:
810
  
Inhibitor
Name:
BDBM50289381
Synonyms:
CHEMBL23246 | Naphthalene-2-sulfonic acid {3-[2-(pyridin-4-ylamino)-ethoxy]-phenyl}-amide
Type:
Small organic molecule
Emp. Form.:
C23H21N3O3S
Mol. Mass.:
419.496
SMILES:
O=S(=O)(Nc1cccc(OCCNc2ccncc2)c1)c1ccc2ccccc2c1
: