Target
Prothrombin
Ligand
BDBM50289382
Substrate
Meas. Tech.
ChEBML_208536
pH
7.5±n/a
Ki
2800±n/a nM
Comments
extracted
Citation
 von der Saal, WKucznierz, RLeinert, HEngh, RA DERIVATIVES OF 4-AMINO-PYRIDINE AS SELECTIVE THROMBIN INHIBITORS Bioorg Med Chem Lett 7:1283-1288 (1997)    Article 
Target
Name:
Prothrombin
Synonyms:
Activation peptide fragment 1 Coagulation factor II Prothrombin precursor Thrombin heavy chain | Thrombin light chain
Type:
Protein
Mol. Mass.:
70029.57
Organism:
Homo sapiens (Human)
Description:
P00734
Residue:
622
  
Inhibitor
Name:
BDBM50289382
Synonyms:
4-Chloro-N-(2-{3-[2-(pyridin-4-ylamino)-ethoxy]-phenyl}-ethyl)-benzenesulfonamide | CHEMBL25890
Type:
Small organic molecule
Emp. Form.:
C21H22ClN3O3S
Mol. Mass.:
431.936
SMILES:
Clc1ccc(cc1)S(=O)(=O)NCCc1cccc(OCCNc2ccncc2)c1
: