Target
Prothrombin
Ligand
BDBM50289375
Substrate
Meas. Tech.
ChEBML_208536
pH
7.5±n/a
Ki
10000±n/a nM
Comments
extracted
Citation
 von der Saal, WKucznierz, RLeinert, HEngh, RA DERIVATIVES OF 4-AMINO-PYRIDINE AS SELECTIVE THROMBIN INHIBITORS Bioorg Med Chem Lett 7:1283-1288 (1997)    Article 
Target
Name:
Prothrombin
Synonyms:
Activation peptide fragment 1 Coagulation factor II Prothrombin precursor Thrombin heavy chain | Thrombin light chain
Type:
Protein
Mol. Mass.:
70029.57
Organism:
Homo sapiens (Human)
Description:
P00734
Residue:
622
  
Inhibitor
Name:
BDBM50289375
Synonyms:
2-Benzenesulfonylamino-N-[(R)-1-(piperidine-1-carbonyl)-3-(pyridin-4-ylamino)-propyl]-acetamide | CHEMBL281715
Type:
Small organic molecule
Emp. Form.:
C22H29N5O4S
Mol. Mass.:
459.562
SMILES:
O=C(CNS(=O)(=O)c1ccccc1)N[C@H](CCNc1ccncc1)C(=O)N1CCCCC1
: