Target
Plasminogen
Ligand
BDBM50037996
Substrate
Meas. Tech.
ChEBML_155257
pH
7.5±n/a
Ki
30000±n/a nM
Comments
extracted
Citation
 von der Saal, WKucznierz, RLeinert, HEngh, RA DERIVATIVES OF 4-AMINO-PYRIDINE AS SELECTIVE THROMBIN INHIBITORS Bioorg Med Chem Lett 7:1283-1288 (1997)    Article 
Target
Name:
Plasminogen
Synonyms:
Activation peptide PLG Plasmin Plasmin heavy chain A, short form | Plasmin light chain B
Type:
Enzyme
Mol. Mass.:
90579.18
Organism:
Homo sapiens (Human)
Description:
Residue:
810
  
Inhibitor
Name:
BDBM50037996
Synonyms:
1-[N-(naphthalen-2-ylsulfonyl)glycyl-4-carbamimidoyl-D-phenylalanyl]piperidine N-[(R)-1-(4-Carbamimidoyl-benzyl)-2-oxo-2-piperidin-1-yl-ethyl]-2-(naphthalene-2-sulfonylamino)-acetamide N-[1-(4-Carbamimidoyl-benzyl)-2-oxo-2-piperidin-1-yl-ethyl]-2-(naphthalene-2-sulfonylamino)-acetamide | N-[1-(4-Carbamimidoyl-benzyl)-2-oxo-2-piperidin-1-yl-ethyl]-2-(naphthalene-2-sulfonylamino)-acetamide(NAPAP)
Type:
Small organic molecule
Emp. Form.:
C27H31N5O4S
Mol. Mass.:
521.631
SMILES:
NC(=N)c1ccc(C[C@@H](NC(=O)CNS(=O)(=O)c2ccc3ccccc3c2)C(=O)N2CCCCC2)cc1
: