Target
Beta-3 adrenergic receptor
Ligand
BDBM50290490
Substrate
Meas. Tech.
ChEBML_38792
EC50
820±n/a nM
Citation
 Beeley, LBerge, JChapman, HDean, DKelly, JLowden, KKotecha, NMorgan, HRami, HThompson, MVong, AWard, R A simplified template approach towards the synthesis of a potent beta-3 adrenoceptor agonist at the human receptor Bioorg Med Chem Lett 7:219-224 (1997)    Article 
Target
Name:
Beta-3 adrenergic receptor
Synonyms:
ADRB3 ADRB3_HUMAN Beta-2 adrenergic receptor and beta-3 adrenergic receptor Beta-3 adrenoreceptor | adrenergic Beta3
Type:
G Protein-Coupled Receptor (GPCR)
Mol. Mass.:
43534.88
Organism:
Homo sapiens (Human)
Description:
Residue:
408
  
Inhibitor
Name:
BDBM50290490
Synonyms:
4-{2-Hydroxy-3-[2-(4-methoxy-phenyl)-ethylamino]-propoxy}-benzene-1,2-diol | CHEMBL302370
Type:
Small organic molecule
Emp. Form.:
C18H23NO5
Mol. Mass.:
333.3789
SMILES:
COc1ccc(CCNC[C@@H](O)COc2ccc(O)c(O)c2)cc1
: