Target
Beta-3 adrenergic receptor
Ligand
BDBM50290495
Substrate
Meas. Tech.
ChEBML_38792
EC50
400±n/a nM
Citation
 Beeley, LBerge, JChapman, HDean, DKelly, JLowden, KKotecha, NMorgan, HRami, HThompson, MVong, AWard, R A simplified template approach towards the synthesis of a potent beta-3 adrenoceptor agonist at the human receptor Bioorg Med Chem Lett 7:219-224 (1997)    Article 
Target
Name:
Beta-3 adrenergic receptor
Synonyms:
ADRB3 ADRB3_HUMAN Beta-2 adrenergic receptor and beta-3 adrenergic receptor Beta-3 adrenoreceptor | adrenergic Beta3
Type:
G Protein-Coupled Receptor (GPCR)
Mol. Mass.:
43534.88
Organism:
Homo sapiens (Human)
Description:
Residue:
408
  
Inhibitor
Name:
BDBM50290495
Synonyms:
CHEMBL305808 | N-(2-Hydroxy-5-{2-hydroxy-3-[2-(4-methoxy-phenyl)-ethylamino]-propoxy}-phenyl)-methanesulfonamide
Type:
Small organic molecule
Emp. Form.:
C19H26N2O6S
Mol. Mass.:
410.485
SMILES:
COc1ccc(CCNC[C@@H](O)COc2ccc(O)c(NS(C)(=O)=O)c2)cc1
: