Target
Glutamate receptor ionotropic, NMDA 1
Ligand
BDBM50069684
Substrate
Meas. Tech.
ChEBML_140308
IC50
840±n/a nM
Citation
 Auberson, YPBischoff, SMoretti, RSchmutz, MVeenstra, SJ 5-Aminomethylquinoxaline-2,3-diones. Part I: A novel class of AMPA receptor antagonists. Bioorg Med Chem Lett 8:65-70 (1999)  
Target
Name:
Glutamate receptor ionotropic, NMDA 1
Synonyms:
Glutamate (NMDA) receptor subunit zeta 1 Glutamate-NMDA-Channel Glutamate-NMDA-Polyamine NMDA Nmdar1 | phencyclidine
Type:
Enzyme Catalytic Domain
Mol. Mass.:
105533.40
Organism:
RAT
Description:
P35439
Residue:
938
  
Inhibitor
Name:
BDBM50069684
Synonyms:
1-(7-Bromo-2,3-dioxo-1,2,3,4-tetrahydro-quinoxalin-6-ylmethyl)-piperidine-2-carboxylic acid | CHEMBL159899
Type:
Small organic molecule
Emp. Form.:
C15H16BrN3O4
Mol. Mass.:
382.209
SMILES:
OC(=O)C1CCCCN1Cc1cc2[nH]c(=O)c(=O)[nH]c2cc1Br
: