Target
Metabotropic glutamate receptor 3
Ligand
BDBM50071159
Substrate
Meas. Tech.
ChEBML_106374
IC50
8580±n/a nM
Citation
 Valli, MJSchoepp, DDWright, RAJohnson, BGKingston, AETomlinson, RMonn, JA Synthesis and metabotropic glutamate receptor antagonist activity of N1-substituted analogs of 2R,4R-4-aminopyrrolidine-2,4-dicarboxylic acid. Bioorg Med Chem Lett 8:1985-90 (1999)  
Target
Name:
Metabotropic glutamate receptor 3
Synonyms:
GPRC1C GRM3_HUMAN metabotropic glutamate 3 metabotropic glutamate 3/1c
Type:
Enzyme Catalytic Domain
Mol. Mass.:
98889.09
Organism:
Homo sapiens (Human)
Description:
metabotropic glutamate 1c 0 HUMAN::Q14832
Residue:
879
  
Inhibitor
Name:
BDBM50071159
Synonyms:
(2R,4R)-4-Amino-1-naphthalen-1-ylmethyl-pyrrolidine-2,4-dicarboxylic acid | CHEMBL302411
Type:
Small organic molecule
Emp. Form.:
C17H18N2O4
Mol. Mass.:
314.3358
SMILES:
N[C@@]1(C[C@@H](N(Cc2cccc3ccccc23)C1)C(O)=O)C(O)=O
: