Target
Metabotropic glutamate receptor 5
Ligand
BDBM50049748
Substrate
Meas. Tech.
ChEBML_106719
IC50
>300000±n/a nM
Citation
 Valli, MJSchoepp, DDWright, RAJohnson, BGKingston, AETomlinson, RMonn, JA Synthesis and metabotropic glutamate receptor antagonist activity of N1-substituted analogs of 2R,4R-4-aminopyrrolidine-2,4-dicarboxylic acid. Bioorg Med Chem Lett 8:1985-90 (1999)  
Target
Name:
Metabotropic glutamate receptor 5
Synonyms:
GPRC1E GRM5_HUMAN metabotropic glutamate 5 | metabotropic glutamate 5a
Type:
Enzyme
Mol. Mass.:
132484.72
Organism:
Homo sapiens (Human)
Description:
Residue:
1212
  
Inhibitor
Name:
BDBM50049748
Synonyms:
(2S,4S)-2-Amino-4-(4,4-diphenyl-butyl)-pentanedioic acid CHEMBL39338
Type:
Small organic molecule
Emp. Form.:
C21H25NO4
Mol. Mass.:
355.4275
SMILES:
N[C@@H](C[C@H](CCCC(c1ccccc1)c1ccccc1)C(O)=O)C(O)=O
: